Ticket #1635: UpdaterTest.txt

File UpdaterTest.txt, 43.8 KB (added by aivar, 6 years ago)

Test results

Line 
1-------------------------------------------------------------------------------
2Test set: imagej.updater.core.UpdaterTest
3-------------------------------------------------------------------------------
4Tests run: 30, Failures: 15, Errors: 1, Skipped: 0, Time elapsed: 5.861 sec <<< FAILURE!
5testUploadConflicts(imagej.updater.core.UpdaterTest)  Time elapsed: 0.39 sec  <<< FAILURE!
6java.lang.AssertionError: Status of macros/dependencee.ijm expected:<MODIFIED> but was:<LOCAL_ONLY>
7        at org.junit.Assert.fail(Assert.java:91)
8        at org.junit.Assert.failNotEquals(Assert.java:645)
9        at org.junit.Assert.assertEquals(Assert.java:126)
10        at imagej.updater.core.UpdaterTest.assertStatus(UpdaterTest.java:1515)
11        at imagej.updater.core.UpdaterTest.assertStatus(UpdaterTest.java:1508)
12        at imagej.updater.core.UpdaterTest.testUploadConflicts(UpdaterTest.java:369)
13        at sun.reflect.NativeMethodAccessorImpl.invoke0(Native Method)
14        at sun.reflect.NativeMethodAccessorImpl.invoke(NativeMethodAccessorImpl.java:39)
15        at sun.reflect.DelegatingMethodAccessorImpl.invoke(DelegatingMethodAccessorImpl.java:25)
16        at java.lang.reflect.Method.invoke(Method.java:597)
17        at org.junit.runners.model.FrameworkMethod$1.runReflectiveCall(FrameworkMethod.java:44)
18        at org.junit.internal.runners.model.ReflectiveCallable.run(ReflectiveCallable.java:15)
19        at org.junit.runners.model.FrameworkMethod.invokeExplosively(FrameworkMethod.java:41)
20        at org.junit.internal.runners.statements.InvokeMethod.evaluate(InvokeMethod.java:20)
21        at org.junit.internal.runners.statements.RunBefores.evaluate(RunBefores.java:28)
22        at org.junit.internal.runners.statements.RunAfters.evaluate(RunAfters.java:31)
23        at org.junit.runners.BlockJUnit4ClassRunner.runChild(BlockJUnit4ClassRunner.java:76)
24        at org.junit.runners.BlockJUnit4ClassRunner.runChild(BlockJUnit4ClassRunner.java:50)
25        at org.junit.runners.ParentRunner$3.run(ParentRunner.java:193)
26        at org.junit.runners.ParentRunner$1.schedule(ParentRunner.java:52)
27        at org.junit.runners.ParentRunner.runChildren(ParentRunner.java:191)
28        at org.junit.runners.ParentRunner.access$000(ParentRunner.java:42)
29        at org.junit.runners.ParentRunner$2.evaluate(ParentRunner.java:184)
30        at org.junit.runners.ParentRunner.run(ParentRunner.java:236)
31        at org.apache.maven.surefire.junit4.JUnit4Provider.execute(JUnit4Provider.java:236)
32        at org.apache.maven.surefire.junit4.JUnit4Provider.executeTestSet(JUnit4Provider.java:134)
33        at org.apache.maven.surefire.junit4.JUnit4Provider.invoke(JUnit4Provider.java:113)
34        at sun.reflect.NativeMethodAccessorImpl.invoke0(Native Method)
35        at sun.reflect.NativeMethodAccessorImpl.invoke(NativeMethodAccessorImpl.java:39)
36        at sun.reflect.DelegatingMethodAccessorImpl.invoke(DelegatingMethodAccessorImpl.java:25)
37        at java.lang.reflect.Method.invoke(Method.java:597)
38        at org.apache.maven.surefire.util.ReflectionUtils.invokeMethodWithArray(ReflectionUtils.java:189)
39        at org.apache.maven.surefire.booter.ProviderFactory$ProviderProxy.invoke(ProviderFactory.java:165)
40        at org.apache.maven.surefire.booter.ProviderFactory.invokeProvider(ProviderFactory.java:85)
41        at org.apache.maven.surefire.booter.ForkedBooter.runSuitesInProcess(ForkedBooter.java:103)
42        at org.apache.maven.surefire.booter.ForkedBooter.main(ForkedBooter.java:74)
43testUpdateConflicts(imagej.updater.core.UpdaterTest)  Time elapsed: 0.35 sec  <<< FAILURE!
44java.lang.AssertionError: Status of macros/obsoleted.ijm expected:<OBSOLETE_UNINSTALLED> but was:<NEW>
45        at org.junit.Assert.fail(Assert.java:91)
46        at org.junit.Assert.failNotEquals(Assert.java:645)
47        at org.junit.Assert.assertEquals(Assert.java:126)
48        at imagej.updater.core.UpdaterTest.assertStatus(UpdaterTest.java:1515)
49        at imagej.updater.core.UpdaterTest.testUpdateConflicts(UpdaterTest.java:443)
50        at sun.reflect.NativeMethodAccessorImpl.invoke0(Native Method)
51        at sun.reflect.NativeMethodAccessorImpl.invoke(NativeMethodAccessorImpl.java:39)
52        at sun.reflect.DelegatingMethodAccessorImpl.invoke(DelegatingMethodAccessorImpl.java:25)
53        at java.lang.reflect.Method.invoke(Method.java:597)
54        at org.junit.runners.model.FrameworkMethod$1.runReflectiveCall(FrameworkMethod.java:44)
55        at org.junit.internal.runners.model.ReflectiveCallable.run(ReflectiveCallable.java:15)
56        at org.junit.runners.model.FrameworkMethod.invokeExplosively(FrameworkMethod.java:41)
57        at org.junit.internal.runners.statements.InvokeMethod.evaluate(InvokeMethod.java:20)
58        at org.junit.internal.runners.statements.RunBefores.evaluate(RunBefores.java:28)
59        at org.junit.internal.runners.statements.RunAfters.evaluate(RunAfters.java:31)
60        at org.junit.runners.BlockJUnit4ClassRunner.runChild(BlockJUnit4ClassRunner.java:76)
61        at org.junit.runners.BlockJUnit4ClassRunner.runChild(BlockJUnit4ClassRunner.java:50)
62        at org.junit.runners.ParentRunner$3.run(ParentRunner.java:193)
63        at org.junit.runners.ParentRunner$1.schedule(ParentRunner.java:52)
64        at org.junit.runners.ParentRunner.runChildren(ParentRunner.java:191)
65        at org.junit.runners.ParentRunner.access$000(ParentRunner.java:42)
66        at org.junit.runners.ParentRunner$2.evaluate(ParentRunner.java:184)
67        at org.junit.runners.ParentRunner.run(ParentRunner.java:236)
68        at org.apache.maven.surefire.junit4.JUnit4Provider.execute(JUnit4Provider.java:236)
69        at org.apache.maven.surefire.junit4.JUnit4Provider.executeTestSet(JUnit4Provider.java:134)
70        at org.apache.maven.surefire.junit4.JUnit4Provider.invoke(JUnit4Provider.java:113)
71        at sun.reflect.NativeMethodAccessorImpl.invoke0(Native Method)
72        at sun.reflect.NativeMethodAccessorImpl.invoke(NativeMethodAccessorImpl.java:39)
73        at sun.reflect.DelegatingMethodAccessorImpl.invoke(DelegatingMethodAccessorImpl.java:25)
74        at java.lang.reflect.Method.invoke(Method.java:597)
75        at org.apache.maven.surefire.util.ReflectionUtils.invokeMethodWithArray(ReflectionUtils.java:189)
76        at org.apache.maven.surefire.booter.ProviderFactory$ProviderProxy.invoke(ProviderFactory.java:165)
77        at org.apache.maven.surefire.booter.ProviderFactory.invokeProvider(ProviderFactory.java:85)
78        at org.apache.maven.surefire.booter.ForkedBooter.runSuitesInProcess(ForkedBooter.java:103)
79        at org.apache.maven.surefire.booter.ForkedBooter.main(ForkedBooter.java:74)
80testUpdateVersionedJars(imagej.updater.core.UpdaterTest)  Time elapsed: 0.17 sec  <<< FAILURE!
81java.lang.AssertionError:
82        at org.junit.Assert.fail(Assert.java:91)
83        at org.junit.Assert.assertTrue(Assert.java:43)
84        at org.junit.Assert.assertTrue(Assert.java:54)
85        at imagej.updater.core.UpdaterTest.testUpdateVersionedJars(UpdaterTest.java:546)
86        at sun.reflect.NativeMethodAccessorImpl.invoke0(Native Method)
87        at sun.reflect.NativeMethodAccessorImpl.invoke(NativeMethodAccessorImpl.java:39)
88        at sun.reflect.DelegatingMethodAccessorImpl.invoke(DelegatingMethodAccessorImpl.java:25)
89        at java.lang.reflect.Method.invoke(Method.java:597)
90        at org.junit.runners.model.FrameworkMethod$1.runReflectiveCall(FrameworkMethod.java:44)
91        at org.junit.internal.runners.model.ReflectiveCallable.run(ReflectiveCallable.java:15)
92        at org.junit.runners.model.FrameworkMethod.invokeExplosively(FrameworkMethod.java:41)
93        at org.junit.internal.runners.statements.InvokeMethod.evaluate(InvokeMethod.java:20)
94        at org.junit.internal.runners.statements.RunBefores.evaluate(RunBefores.java:28)
95        at org.junit.internal.runners.statements.RunAfters.evaluate(RunAfters.java:31)
96        at org.junit.runners.BlockJUnit4ClassRunner.runChild(BlockJUnit4ClassRunner.java:76)
97        at org.junit.runners.BlockJUnit4ClassRunner.runChild(BlockJUnit4ClassRunner.java:50)
98        at org.junit.runners.ParentRunner$3.run(ParentRunner.java:193)
99        at org.junit.runners.ParentRunner$1.schedule(ParentRunner.java:52)
100        at org.junit.runners.ParentRunner.runChildren(ParentRunner.java:191)
101        at org.junit.runners.ParentRunner.access$000(ParentRunner.java:42)
102        at org.junit.runners.ParentRunner$2.evaluate(ParentRunner.java:184)
103        at org.junit.runners.ParentRunner.run(ParentRunner.java:236)
104        at org.apache.maven.surefire.junit4.JUnit4Provider.execute(JUnit4Provider.java:236)
105        at org.apache.maven.surefire.junit4.JUnit4Provider.executeTestSet(JUnit4Provider.java:134)
106        at org.apache.maven.surefire.junit4.JUnit4Provider.invoke(JUnit4Provider.java:113)
107        at sun.reflect.NativeMethodAccessorImpl.invoke0(Native Method)
108        at sun.reflect.NativeMethodAccessorImpl.invoke(NativeMethodAccessorImpl.java:39)
109        at sun.reflect.DelegatingMethodAccessorImpl.invoke(DelegatingMethodAccessorImpl.java:25)
110        at java.lang.reflect.Method.invoke(Method.java:597)
111        at org.apache.maven.surefire.util.ReflectionUtils.invokeMethodWithArray(ReflectionUtils.java:189)
112        at org.apache.maven.surefire.booter.ProviderFactory$ProviderProxy.invoke(ProviderFactory.java:165)
113        at org.apache.maven.surefire.booter.ProviderFactory.invokeProvider(ProviderFactory.java:85)
114        at org.apache.maven.surefire.booter.ForkedBooter.runSuitesInProcess(ForkedBooter.java:103)
115        at org.apache.maven.surefire.booter.ForkedBooter.main(ForkedBooter.java:74)
116testConflictingVersionsToUpload(imagej.updater.core.UpdaterTest)  Time elapsed: 0.1 sec  <<< FAILURE!
117java.lang.AssertionError:
118        at org.junit.Assert.fail(Assert.java:91)
119        at org.junit.Assert.assertTrue(Assert.java:43)
120        at org.junit.Assert.assertTrue(Assert.java:54)
121        at imagej.updater.core.UpdaterTest.testConflictingVersionsToUpload(UpdaterTest.java:679)
122        at sun.reflect.NativeMethodAccessorImpl.invoke0(Native Method)
123        at sun.reflect.NativeMethodAccessorImpl.invoke(NativeMethodAccessorImpl.java:39)
124        at sun.reflect.DelegatingMethodAccessorImpl.invoke(DelegatingMethodAccessorImpl.java:25)
125        at java.lang.reflect.Method.invoke(Method.java:597)
126        at org.junit.runners.model.FrameworkMethod$1.runReflectiveCall(FrameworkMethod.java:44)
127        at org.junit.internal.runners.model.ReflectiveCallable.run(ReflectiveCallable.java:15)
128        at org.junit.runners.model.FrameworkMethod.invokeExplosively(FrameworkMethod.java:41)
129        at org.junit.internal.runners.statements.InvokeMethod.evaluate(InvokeMethod.java:20)
130        at org.junit.internal.runners.statements.RunBefores.evaluate(RunBefores.java:28)
131        at org.junit.internal.runners.statements.RunAfters.evaluate(RunAfters.java:31)
132        at org.junit.runners.BlockJUnit4ClassRunner.runChild(BlockJUnit4ClassRunner.java:76)
133        at org.junit.runners.BlockJUnit4ClassRunner.runChild(BlockJUnit4ClassRunner.java:50)
134        at org.junit.runners.ParentRunner$3.run(ParentRunner.java:193)
135        at org.junit.runners.ParentRunner$1.schedule(ParentRunner.java:52)
136        at org.junit.runners.ParentRunner.runChildren(ParentRunner.java:191)
137        at org.junit.runners.ParentRunner.access$000(ParentRunner.java:42)
138        at org.junit.runners.ParentRunner$2.evaluate(ParentRunner.java:184)
139        at org.junit.runners.ParentRunner.run(ParentRunner.java:236)
140        at org.apache.maven.surefire.junit4.JUnit4Provider.execute(JUnit4Provider.java:236)
141        at org.apache.maven.surefire.junit4.JUnit4Provider.executeTestSet(JUnit4Provider.java:134)
142        at org.apache.maven.surefire.junit4.JUnit4Provider.invoke(JUnit4Provider.java:113)
143        at sun.reflect.NativeMethodAccessorImpl.invoke0(Native Method)
144        at sun.reflect.NativeMethodAccessorImpl.invoke(NativeMethodAccessorImpl.java:39)
145        at sun.reflect.DelegatingMethodAccessorImpl.invoke(DelegatingMethodAccessorImpl.java:25)
146        at java.lang.reflect.Method.invoke(Method.java:597)
147        at org.apache.maven.surefire.util.ReflectionUtils.invokeMethodWithArray(ReflectionUtils.java:189)
148        at org.apache.maven.surefire.booter.ProviderFactory$ProviderProxy.invoke(ProviderFactory.java:165)
149        at org.apache.maven.surefire.booter.ProviderFactory.invokeProvider(ProviderFactory.java:85)
150        at org.apache.maven.surefire.booter.ForkedBooter.runSuitesInProcess(ForkedBooter.java:103)
151        at org.apache.maven.surefire.booter.ForkedBooter.main(ForkedBooter.java:74)
152testMultipleUpdateSites(imagej.updater.core.UpdaterTest)  Time elapsed: 0.421 sec  <<< FAILURE!
153java.lang.AssertionError:
154        at org.junit.Assert.fail(Assert.java:91)
155        at org.junit.Assert.assertTrue(Assert.java:43)
156        at org.junit.Assert.assertTrue(Assert.java:54)
157        at imagej.updater.core.UpdaterTest.testMultipleUpdateSites(UpdaterTest.java:709)
158        at sun.reflect.NativeMethodAccessorImpl.invoke0(Native Method)
159        at sun.reflect.NativeMethodAccessorImpl.invoke(NativeMethodAccessorImpl.java:39)
160        at sun.reflect.DelegatingMethodAccessorImpl.invoke(DelegatingMethodAccessorImpl.java:25)
161        at java.lang.reflect.Method.invoke(Method.java:597)
162        at org.junit.runners.model.FrameworkMethod$1.runReflectiveCall(FrameworkMethod.java:44)
163        at org.junit.internal.runners.model.ReflectiveCallable.run(ReflectiveCallable.java:15)
164        at org.junit.runners.model.FrameworkMethod.invokeExplosively(FrameworkMethod.java:41)
165        at org.junit.internal.runners.statements.InvokeMethod.evaluate(InvokeMethod.java:20)
166        at org.junit.internal.runners.statements.RunBefores.evaluate(RunBefores.java:28)
167        at org.junit.internal.runners.statements.RunAfters.evaluate(RunAfters.java:31)
168        at org.junit.runners.BlockJUnit4ClassRunner.runChild(BlockJUnit4ClassRunner.java:76)
169        at org.junit.runners.BlockJUnit4ClassRunner.runChild(BlockJUnit4ClassRunner.java:50)
170        at org.junit.runners.ParentRunner$3.run(ParentRunner.java:193)
171        at org.junit.runners.ParentRunner$1.schedule(ParentRunner.java:52)
172        at org.junit.runners.ParentRunner.runChildren(ParentRunner.java:191)
173        at org.junit.runners.ParentRunner.access$000(ParentRunner.java:42)
174        at org.junit.runners.ParentRunner$2.evaluate(ParentRunner.java:184)
175        at org.junit.runners.ParentRunner.run(ParentRunner.java:236)
176        at org.apache.maven.surefire.junit4.JUnit4Provider.execute(JUnit4Provider.java:236)
177        at org.apache.maven.surefire.junit4.JUnit4Provider.executeTestSet(JUnit4Provider.java:134)
178        at org.apache.maven.surefire.junit4.JUnit4Provider.invoke(JUnit4Provider.java:113)
179        at sun.reflect.NativeMethodAccessorImpl.invoke0(Native Method)
180        at sun.reflect.NativeMethodAccessorImpl.invoke(NativeMethodAccessorImpl.java:39)
181        at sun.reflect.DelegatingMethodAccessorImpl.invoke(DelegatingMethodAccessorImpl.java:25)
182        at java.lang.reflect.Method.invoke(Method.java:597)
183        at org.apache.maven.surefire.util.ReflectionUtils.invokeMethodWithArray(ReflectionUtils.java:189)
184        at org.apache.maven.surefire.booter.ProviderFactory$ProviderProxy.invoke(ProviderFactory.java:165)
185        at org.apache.maven.surefire.booter.ProviderFactory.invokeProvider(ProviderFactory.java:85)
186        at org.apache.maven.surefire.booter.ForkedBooter.runSuitesInProcess(ForkedBooter.java:103)
187        at org.apache.maven.surefire.booter.ForkedBooter.main(ForkedBooter.java:74)
188testUpdateable(imagej.updater.core.UpdaterTest)  Time elapsed: 0.01 sec  <<< FAILURE!
189java.lang.AssertionError:
190        at org.junit.Assert.fail(Assert.java:91)
191        at org.junit.Assert.assertTrue(Assert.java:43)
192        at org.junit.Assert.assertTrue(Assert.java:54)
193        at imagej.updater.core.UpdaterTest.testUpdateable(UpdaterTest.java:728)
194        at sun.reflect.NativeMethodAccessorImpl.invoke0(Native Method)
195        at sun.reflect.NativeMethodAccessorImpl.invoke(NativeMethodAccessorImpl.java:39)
196        at sun.reflect.DelegatingMethodAccessorImpl.invoke(DelegatingMethodAccessorImpl.java:25)
197        at java.lang.reflect.Method.invoke(Method.java:597)
198        at org.junit.runners.model.FrameworkMethod$1.runReflectiveCall(FrameworkMethod.java:44)
199        at org.junit.internal.runners.model.ReflectiveCallable.run(ReflectiveCallable.java:15)
200        at org.junit.runners.model.FrameworkMethod.invokeExplosively(FrameworkMethod.java:41)
201        at org.junit.internal.runners.statements.InvokeMethod.evaluate(InvokeMethod.java:20)
202        at org.junit.internal.runners.statements.RunBefores.evaluate(RunBefores.java:28)
203        at org.junit.internal.runners.statements.RunAfters.evaluate(RunAfters.java:31)
204        at org.junit.runners.BlockJUnit4ClassRunner.runChild(BlockJUnit4ClassRunner.java:76)
205        at org.junit.runners.BlockJUnit4ClassRunner.runChild(BlockJUnit4ClassRunner.java:50)
206        at org.junit.runners.ParentRunner$3.run(ParentRunner.java:193)
207        at org.junit.runners.ParentRunner$1.schedule(ParentRunner.java:52)
208        at org.junit.runners.ParentRunner.runChildren(ParentRunner.java:191)
209        at org.junit.runners.ParentRunner.access$000(ParentRunner.java:42)
210        at org.junit.runners.ParentRunner$2.evaluate(ParentRunner.java:184)
211        at org.junit.runners.ParentRunner.run(ParentRunner.java:236)
212        at org.apache.maven.surefire.junit4.JUnit4Provider.execute(JUnit4Provider.java:236)
213        at org.apache.maven.surefire.junit4.JUnit4Provider.executeTestSet(JUnit4Provider.java:134)
214        at org.apache.maven.surefire.junit4.JUnit4Provider.invoke(JUnit4Provider.java:113)
215        at sun.reflect.NativeMethodAccessorImpl.invoke0(Native Method)
216        at sun.reflect.NativeMethodAccessorImpl.invoke(NativeMethodAccessorImpl.java:39)
217        at sun.reflect.DelegatingMethodAccessorImpl.invoke(DelegatingMethodAccessorImpl.java:25)
218        at java.lang.reflect.Method.invoke(Method.java:597)
219        at org.apache.maven.surefire.util.ReflectionUtils.invokeMethodWithArray(ReflectionUtils.java:189)
220        at org.apache.maven.surefire.booter.ProviderFactory$ProviderProxy.invoke(ProviderFactory.java:165)
221        at org.apache.maven.surefire.booter.ProviderFactory.invokeProvider(ProviderFactory.java:85)
222        at org.apache.maven.surefire.booter.ForkedBooter.runSuitesInProcess(ForkedBooter.java:103)
223        at org.apache.maven.surefire.booter.ForkedBooter.main(ForkedBooter.java:74)
224testReReadFiles(imagej.updater.core.UpdaterTest)  Time elapsed: 0.06 sec  <<< FAILURE!
225java.lang.AssertionError: expected:<Narf> but was:<null>
226        at org.junit.Assert.fail(Assert.java:91)
227        at org.junit.Assert.failNotEquals(Assert.java:645)
228        at org.junit.Assert.assertEquals(Assert.java:126)
229        at org.junit.Assert.assertEquals(Assert.java:145)
230        at imagej.updater.core.UpdaterTest.testReReadFiles(UpdaterTest.java:781)
231        at sun.reflect.NativeMethodAccessorImpl.invoke0(Native Method)
232        at sun.reflect.NativeMethodAccessorImpl.invoke(NativeMethodAccessorImpl.java:39)
233        at sun.reflect.DelegatingMethodAccessorImpl.invoke(DelegatingMethodAccessorImpl.java:25)
234        at java.lang.reflect.Method.invoke(Method.java:597)
235        at org.junit.runners.model.FrameworkMethod$1.runReflectiveCall(FrameworkMethod.java:44)
236        at org.junit.internal.runners.model.ReflectiveCallable.run(ReflectiveCallable.java:15)
237        at org.junit.runners.model.FrameworkMethod.invokeExplosively(FrameworkMethod.java:41)
238        at org.junit.internal.runners.statements.InvokeMethod.evaluate(InvokeMethod.java:20)
239        at org.junit.internal.runners.statements.RunBefores.evaluate(RunBefores.java:28)
240        at org.junit.internal.runners.statements.RunAfters.evaluate(RunAfters.java:31)
241        at org.junit.runners.BlockJUnit4ClassRunner.runChild(BlockJUnit4ClassRunner.java:76)
242        at org.junit.runners.BlockJUnit4ClassRunner.runChild(BlockJUnit4ClassRunner.java:50)
243        at org.junit.runners.ParentRunner$3.run(ParentRunner.java:193)
244        at org.junit.runners.ParentRunner$1.schedule(ParentRunner.java:52)
245        at org.junit.runners.ParentRunner.runChildren(ParentRunner.java:191)
246        at org.junit.runners.ParentRunner.access$000(ParentRunner.java:42)
247        at org.junit.runners.ParentRunner$2.evaluate(ParentRunner.java:184)
248        at org.junit.runners.ParentRunner.run(ParentRunner.java:236)
249        at org.apache.maven.surefire.junit4.JUnit4Provider.execute(JUnit4Provider.java:236)
250        at org.apache.maven.surefire.junit4.JUnit4Provider.executeTestSet(JUnit4Provider.java:134)
251        at org.apache.maven.surefire.junit4.JUnit4Provider.invoke(JUnit4Provider.java:113)
252        at sun.reflect.NativeMethodAccessorImpl.invoke0(Native Method)
253        at sun.reflect.NativeMethodAccessorImpl.invoke(NativeMethodAccessorImpl.java:39)
254        at sun.reflect.DelegatingMethodAccessorImpl.invoke(DelegatingMethodAccessorImpl.java:25)
255        at java.lang.reflect.Method.invoke(Method.java:597)
256        at org.apache.maven.surefire.util.ReflectionUtils.invokeMethodWithArray(ReflectionUtils.java:189)
257        at org.apache.maven.surefire.booter.ProviderFactory$ProviderProxy.invoke(ProviderFactory.java:165)
258        at org.apache.maven.surefire.booter.ProviderFactory.invokeProvider(ProviderFactory.java:85)
259        at org.apache.maven.surefire.booter.ForkedBooter.runSuitesInProcess(ForkedBooter.java:103)
260        at org.apache.maven.surefire.booter.ForkedBooter.main(ForkedBooter.java:74)
261testUpdateTheUpdater(imagej.updater.core.UpdaterTest)  Time elapsed: 0.11 sec  <<< FAILURE!
262java.lang.AssertionError:
263        at org.junit.Assert.fail(Assert.java:91)
264        at org.junit.Assert.assertTrue(Assert.java:43)
265        at org.junit.Assert.assertTrue(Assert.java:54)
266        at imagej.updater.core.UpdaterTest.testUpdateTheUpdater(UpdaterTest.java:795)
267        at sun.reflect.NativeMethodAccessorImpl.invoke0(Native Method)
268        at sun.reflect.NativeMethodAccessorImpl.invoke(NativeMethodAccessorImpl.java:39)
269        at sun.reflect.DelegatingMethodAccessorImpl.invoke(DelegatingMethodAccessorImpl.java:25)
270        at java.lang.reflect.Method.invoke(Method.java:597)
271        at org.junit.runners.model.FrameworkMethod$1.runReflectiveCall(FrameworkMethod.java:44)
272        at org.junit.internal.runners.model.ReflectiveCallable.run(ReflectiveCallable.java:15)
273        at org.junit.runners.model.FrameworkMethod.invokeExplosively(FrameworkMethod.java:41)
274        at org.junit.internal.runners.statements.InvokeMethod.evaluate(InvokeMethod.java:20)
275        at org.junit.internal.runners.statements.RunBefores.evaluate(RunBefores.java:28)
276        at org.junit.internal.runners.statements.RunAfters.evaluate(RunAfters.java:31)
277        at org.junit.runners.BlockJUnit4ClassRunner.runChild(BlockJUnit4ClassRunner.java:76)
278        at org.junit.runners.BlockJUnit4ClassRunner.runChild(BlockJUnit4ClassRunner.java:50)
279        at org.junit.runners.ParentRunner$3.run(ParentRunner.java:193)
280        at org.junit.runners.ParentRunner$1.schedule(ParentRunner.java:52)
281        at org.junit.runners.ParentRunner.runChildren(ParentRunner.java:191)
282        at org.junit.runners.ParentRunner.access$000(ParentRunner.java:42)
283        at org.junit.runners.ParentRunner$2.evaluate(ParentRunner.java:184)
284        at org.junit.runners.ParentRunner.run(ParentRunner.java:236)
285        at org.apache.maven.surefire.junit4.JUnit4Provider.execute(JUnit4Provider.java:236)
286        at org.apache.maven.surefire.junit4.JUnit4Provider.executeTestSet(JUnit4Provider.java:134)
287        at org.apache.maven.surefire.junit4.JUnit4Provider.invoke(JUnit4Provider.java:113)
288        at sun.reflect.NativeMethodAccessorImpl.invoke0(Native Method)
289        at sun.reflect.NativeMethodAccessorImpl.invoke(NativeMethodAccessorImpl.java:39)
290        at sun.reflect.DelegatingMethodAccessorImpl.invoke(DelegatingMethodAccessorImpl.java:25)
291        at java.lang.reflect.Method.invoke(Method.java:597)
292        at org.apache.maven.surefire.util.ReflectionUtils.invokeMethodWithArray(ReflectionUtils.java:189)
293        at org.apache.maven.surefire.booter.ProviderFactory$ProviderProxy.invoke(ProviderFactory.java:165)
294        at org.apache.maven.surefire.booter.ProviderFactory.invokeProvider(ProviderFactory.java:85)
295        at org.apache.maven.surefire.booter.ForkedBooter.runSuitesInProcess(ForkedBooter.java:103)
296        at org.apache.maven.surefire.booter.ForkedBooter.main(ForkedBooter.java:74)
297testHandlingOfObsoleteChecksums(imagej.updater.core.UpdaterTest)  Time elapsed: 0.03 sec  <<< FAILURE!
298java.lang.AssertionError:
299        at org.junit.Assert.fail(Assert.java:91)
300        at org.junit.Assert.assertTrue(Assert.java:43)
301        at org.junit.Assert.assertTrue(Assert.java:54)
302        at imagej.updater.core.UpdaterTest.testHandlingOfObsoleteChecksums(UpdaterTest.java:965)
303        at sun.reflect.NativeMethodAccessorImpl.invoke0(Native Method)
304        at sun.reflect.NativeMethodAccessorImpl.invoke(NativeMethodAccessorImpl.java:39)
305        at sun.reflect.DelegatingMethodAccessorImpl.invoke(DelegatingMethodAccessorImpl.java:25)
306        at java.lang.reflect.Method.invoke(Method.java:597)
307        at org.junit.runners.model.FrameworkMethod$1.runReflectiveCall(FrameworkMethod.java:44)
308        at org.junit.internal.runners.model.ReflectiveCallable.run(ReflectiveCallable.java:15)
309        at org.junit.runners.model.FrameworkMethod.invokeExplosively(FrameworkMethod.java:41)
310        at org.junit.internal.runners.statements.InvokeMethod.evaluate(InvokeMethod.java:20)
311        at org.junit.internal.runners.statements.RunBefores.evaluate(RunBefores.java:28)
312        at org.junit.internal.runners.statements.RunAfters.evaluate(RunAfters.java:31)
313        at org.junit.runners.BlockJUnit4ClassRunner.runChild(BlockJUnit4ClassRunner.java:76)
314        at org.junit.runners.BlockJUnit4ClassRunner.runChild(BlockJUnit4ClassRunner.java:50)
315        at org.junit.runners.ParentRunner$3.run(ParentRunner.java:193)
316        at org.junit.runners.ParentRunner$1.schedule(ParentRunner.java:52)
317        at org.junit.runners.ParentRunner.runChildren(ParentRunner.java:191)
318        at org.junit.runners.ParentRunner.access$000(ParentRunner.java:42)
319        at org.junit.runners.ParentRunner$2.evaluate(ParentRunner.java:184)
320        at org.junit.runners.ParentRunner.run(ParentRunner.java:236)
321        at org.apache.maven.surefire.junit4.JUnit4Provider.execute(JUnit4Provider.java:236)
322        at org.apache.maven.surefire.junit4.JUnit4Provider.executeTestSet(JUnit4Provider.java:134)
323        at org.apache.maven.surefire.junit4.JUnit4Provider.invoke(JUnit4Provider.java:113)
324        at sun.reflect.NativeMethodAccessorImpl.invoke0(Native Method)
325        at sun.reflect.NativeMethodAccessorImpl.invoke(NativeMethodAccessorImpl.java:39)
326        at sun.reflect.DelegatingMethodAccessorImpl.invoke(DelegatingMethodAccessorImpl.java:25)
327        at java.lang.reflect.Method.invoke(Method.java:597)
328        at org.apache.maven.surefire.util.ReflectionUtils.invokeMethodWithArray(ReflectionUtils.java:189)
329        at org.apache.maven.surefire.booter.ProviderFactory$ProviderProxy.invoke(ProviderFactory.java:165)
330        at org.apache.maven.surefire.booter.ProviderFactory.invokeProvider(ProviderFactory.java:85)
331        at org.apache.maven.surefire.booter.ForkedBooter.runSuitesInProcess(ForkedBooter.java:103)
332        at org.apache.maven.surefire.booter.ForkedBooter.main(ForkedBooter.java:74)
333testUpdateToDifferentVersion(imagej.updater.core.UpdaterTest)  Time elapsed: 0.07 sec  <<< FAILURE!
334java.lang.AssertionError:
335        at org.junit.Assert.fail(Assert.java:91)
336        at org.junit.Assert.assertTrue(Assert.java:43)
337        at org.junit.Assert.assertTrue(Assert.java:54)
338        at imagej.updater.core.UpdaterTest.testUpdateToDifferentVersion(UpdaterTest.java:984)
339        at sun.reflect.NativeMethodAccessorImpl.invoke0(Native Method)
340        at sun.reflect.NativeMethodAccessorImpl.invoke(NativeMethodAccessorImpl.java:39)
341        at sun.reflect.DelegatingMethodAccessorImpl.invoke(DelegatingMethodAccessorImpl.java:25)
342        at java.lang.reflect.Method.invoke(Method.java:597)
343        at org.junit.runners.model.FrameworkMethod$1.runReflectiveCall(FrameworkMethod.java:44)
344        at org.junit.internal.runners.model.ReflectiveCallable.run(ReflectiveCallable.java:15)
345        at org.junit.runners.model.FrameworkMethod.invokeExplosively(FrameworkMethod.java:41)
346        at org.junit.internal.runners.statements.InvokeMethod.evaluate(InvokeMethod.java:20)
347        at org.junit.internal.runners.statements.RunBefores.evaluate(RunBefores.java:28)
348        at org.junit.internal.runners.statements.RunAfters.evaluate(RunAfters.java:31)
349        at org.junit.runners.BlockJUnit4ClassRunner.runChild(BlockJUnit4ClassRunner.java:76)
350        at org.junit.runners.BlockJUnit4ClassRunner.runChild(BlockJUnit4ClassRunner.java:50)
351        at org.junit.runners.ParentRunner$3.run(ParentRunner.java:193)
352        at org.junit.runners.ParentRunner$1.schedule(ParentRunner.java:52)
353        at org.junit.runners.ParentRunner.runChildren(ParentRunner.java:191)
354        at org.junit.runners.ParentRunner.access$000(ParentRunner.java:42)
355        at org.junit.runners.ParentRunner$2.evaluate(ParentRunner.java:184)
356        at org.junit.runners.ParentRunner.run(ParentRunner.java:236)
357        at org.apache.maven.surefire.junit4.JUnit4Provider.execute(JUnit4Provider.java:236)
358        at org.apache.maven.surefire.junit4.JUnit4Provider.executeTestSet(JUnit4Provider.java:134)
359        at org.apache.maven.surefire.junit4.JUnit4Provider.invoke(JUnit4Provider.java:113)
360        at sun.reflect.NativeMethodAccessorImpl.invoke0(Native Method)
361        at sun.reflect.NativeMethodAccessorImpl.invoke(NativeMethodAccessorImpl.java:39)
362        at sun.reflect.DelegatingMethodAccessorImpl.invoke(DelegatingMethodAccessorImpl.java:25)
363        at java.lang.reflect.Method.invoke(Method.java:597)
364        at org.apache.maven.surefire.util.ReflectionUtils.invokeMethodWithArray(ReflectionUtils.java:189)
365        at org.apache.maven.surefire.booter.ProviderFactory$ProviderProxy.invoke(ProviderFactory.java:165)
366        at org.apache.maven.surefire.booter.ProviderFactory.invokeProvider(ProviderFactory.java:85)
367        at org.apache.maven.surefire.booter.ForkedBooter.runSuitesInProcess(ForkedBooter.java:103)
368        at org.apache.maven.surefire.booter.ForkedBooter.main(ForkedBooter.java:74)
369reconcileMultipleVersions(imagej.updater.core.UpdaterTest)  Time elapsed: 0.28 sec  <<< FAILURE!
370java.lang.AssertionError:
371        at org.junit.Assert.fail(Assert.java:91)
372        at org.junit.Assert.assertTrue(Assert.java:43)
373        at org.junit.Assert.assertTrue(Assert.java:54)
374        at imagej.updater.core.UpdaterTest.reconcileMultipleVersions(UpdaterTest.java:1042)
375        at sun.reflect.NativeMethodAccessorImpl.invoke0(Native Method)
376        at sun.reflect.NativeMethodAccessorImpl.invoke(NativeMethodAccessorImpl.java:39)
377        at sun.reflect.DelegatingMethodAccessorImpl.invoke(DelegatingMethodAccessorImpl.java:25)
378        at java.lang.reflect.Method.invoke(Method.java:597)
379        at org.junit.runners.model.FrameworkMethod$1.runReflectiveCall(FrameworkMethod.java:44)
380        at org.junit.internal.runners.model.ReflectiveCallable.run(ReflectiveCallable.java:15)
381        at org.junit.runners.model.FrameworkMethod.invokeExplosively(FrameworkMethod.java:41)
382        at org.junit.internal.runners.statements.InvokeMethod.evaluate(InvokeMethod.java:20)
383        at org.junit.internal.runners.statements.RunBefores.evaluate(RunBefores.java:28)
384        at org.junit.internal.runners.statements.RunAfters.evaluate(RunAfters.java:31)
385        at org.junit.runners.BlockJUnit4ClassRunner.runChild(BlockJUnit4ClassRunner.java:76)
386        at org.junit.runners.BlockJUnit4ClassRunner.runChild(BlockJUnit4ClassRunner.java:50)
387        at org.junit.runners.ParentRunner$3.run(ParentRunner.java:193)
388        at org.junit.runners.ParentRunner$1.schedule(ParentRunner.java:52)
389        at org.junit.runners.ParentRunner.runChildren(ParentRunner.java:191)
390        at org.junit.runners.ParentRunner.access$000(ParentRunner.java:42)
391        at org.junit.runners.ParentRunner$2.evaluate(ParentRunner.java:184)
392        at org.junit.runners.ParentRunner.run(ParentRunner.java:236)
393        at org.apache.maven.surefire.junit4.JUnit4Provider.execute(JUnit4Provider.java:236)
394        at org.apache.maven.surefire.junit4.JUnit4Provider.executeTestSet(JUnit4Provider.java:134)
395        at org.apache.maven.surefire.junit4.JUnit4Provider.invoke(JUnit4Provider.java:113)
396        at sun.reflect.NativeMethodAccessorImpl.invoke0(Native Method)
397        at sun.reflect.NativeMethodAccessorImpl.invoke(NativeMethodAccessorImpl.java:39)
398        at sun.reflect.DelegatingMethodAccessorImpl.invoke(DelegatingMethodAccessorImpl.java:25)
399        at java.lang.reflect.Method.invoke(Method.java:597)
400        at org.apache.maven.surefire.util.ReflectionUtils.invokeMethodWithArray(ReflectionUtils.java:189)
401        at org.apache.maven.surefire.booter.ProviderFactory$ProviderProxy.invoke(ProviderFactory.java:165)
402        at org.apache.maven.surefire.booter.ProviderFactory.invokeProvider(ProviderFactory.java:85)
403        at org.apache.maven.surefire.booter.ForkedBooter.runSuitesInProcess(ForkedBooter.java:103)
404        at org.apache.maven.surefire.booter.ForkedBooter.main(ForkedBooter.java:74)
405uninstallRemoved(imagej.updater.core.UpdaterTest)  Time elapsed: 0 sec  <<< FAILURE!
406java.lang.AssertionError: Status of jars/to-be-removed.jar expected:<OBSOLETE> but was:<INSTALLED>
407        at org.junit.Assert.fail(Assert.java:91)
408        at org.junit.Assert.failNotEquals(Assert.java:645)
409        at org.junit.Assert.assertEquals(Assert.java:126)
410        at imagej.updater.core.UpdaterTest.assertStatus(UpdaterTest.java:1515)
411        at imagej.updater.core.UpdaterTest.uninstallRemoved(UpdaterTest.java:1084)
412        at sun.reflect.NativeMethodAccessorImpl.invoke0(Native Method)
413        at sun.reflect.NativeMethodAccessorImpl.invoke(NativeMethodAccessorImpl.java:39)
414        at sun.reflect.DelegatingMethodAccessorImpl.invoke(DelegatingMethodAccessorImpl.java:25)
415        at java.lang.reflect.Method.invoke(Method.java:597)
416        at org.junit.runners.model.FrameworkMethod$1.runReflectiveCall(FrameworkMethod.java:44)
417        at org.junit.internal.runners.model.ReflectiveCallable.run(ReflectiveCallable.java:15)
418        at org.junit.runners.model.FrameworkMethod.invokeExplosively(FrameworkMethod.java:41)
419        at org.junit.internal.runners.statements.InvokeMethod.evaluate(InvokeMethod.java:20)
420        at org.junit.internal.runners.statements.RunBefores.evaluate(RunBefores.java:28)
421        at org.junit.internal.runners.statements.RunAfters.evaluate(RunAfters.java:31)
422        at org.junit.runners.BlockJUnit4ClassRunner.runChild(BlockJUnit4ClassRunner.java:76)
423        at org.junit.runners.BlockJUnit4ClassRunner.runChild(BlockJUnit4ClassRunner.java:50)
424        at org.junit.runners.ParentRunner$3.run(ParentRunner.java:193)
425        at org.junit.runners.ParentRunner$1.schedule(ParentRunner.java:52)
426        at org.junit.runners.ParentRunner.runChildren(ParentRunner.java:191)
427        at org.junit.runners.ParentRunner.access$000(ParentRunner.java:42)
428        at org.junit.runners.ParentRunner$2.evaluate(ParentRunner.java:184)
429        at org.junit.runners.ParentRunner.run(ParentRunner.java:236)
430        at org.apache.maven.surefire.junit4.JUnit4Provider.execute(JUnit4Provider.java:236)
431        at org.apache.maven.surefire.junit4.JUnit4Provider.executeTestSet(JUnit4Provider.java:134)
432        at org.apache.maven.surefire.junit4.JUnit4Provider.invoke(JUnit4Provider.java:113)
433        at sun.reflect.NativeMethodAccessorImpl.invoke0(Native Method)
434        at sun.reflect.NativeMethodAccessorImpl.invoke(NativeMethodAccessorImpl.java:39)
435        at sun.reflect.DelegatingMethodAccessorImpl.invoke(DelegatingMethodAccessorImpl.java:25)
436        at java.lang.reflect.Method.invoke(Method.java:597)
437        at org.apache.maven.surefire.util.ReflectionUtils.invokeMethodWithArray(ReflectionUtils.java:189)
438        at org.apache.maven.surefire.booter.ProviderFactory$ProviderProxy.invoke(ProviderFactory.java:165)
439        at org.apache.maven.surefire.booter.ProviderFactory.invokeProvider(ProviderFactory.java:85)
440        at org.apache.maven.surefire.booter.ForkedBooter.runSuitesInProcess(ForkedBooter.java:103)
441        at org.apache.maven.surefire.booter.ForkedBooter.main(ForkedBooter.java:74)
442keepObsoleteRecords(imagej.updater.core.UpdaterTest)  Time elapsed: 0.09 sec  <<< FAILURE!
443java.lang.AssertionError:
444        at org.junit.Assert.fail(Assert.java:91)
445        at org.junit.Assert.assertTrue(Assert.java:43)
446        at org.junit.Assert.assertTrue(Assert.java:54)
447        at imagej.updater.core.UpdaterTest.keepObsoleteRecords(UpdaterTest.java:1135)
448        at sun.reflect.NativeMethodAccessorImpl.invoke0(Native Method)
449        at sun.reflect.NativeMethodAccessorImpl.invoke(NativeMethodAccessorImpl.java:39)
450        at sun.reflect.DelegatingMethodAccessorImpl.invoke(DelegatingMethodAccessorImpl.java:25)
451        at java.lang.reflect.Method.invoke(Method.java:597)
452        at org.junit.runners.model.FrameworkMethod$1.runReflectiveCall(FrameworkMethod.java:44)
453        at org.junit.internal.runners.model.ReflectiveCallable.run(ReflectiveCallable.java:15)
454        at org.junit.runners.model.FrameworkMethod.invokeExplosively(FrameworkMethod.java:41)
455        at org.junit.internal.runners.statements.InvokeMethod.evaluate(InvokeMethod.java:20)
456        at org.junit.internal.runners.statements.RunBefores.evaluate(RunBefores.java:28)
457        at org.junit.internal.runners.statements.RunAfters.evaluate(RunAfters.java:31)
458        at org.junit.runners.BlockJUnit4ClassRunner.runChild(BlockJUnit4ClassRunner.java:76)
459        at org.junit.runners.BlockJUnit4ClassRunner.runChild(BlockJUnit4ClassRunner.java:50)
460        at org.junit.runners.ParentRunner$3.run(ParentRunner.java:193)
461        at org.junit.runners.ParentRunner$1.schedule(ParentRunner.java:52)
462        at org.junit.runners.ParentRunner.runChildren(ParentRunner.java:191)
463        at org.junit.runners.ParentRunner.access$000(ParentRunner.java:42)
464        at org.junit.runners.ParentRunner$2.evaluate(ParentRunner.java:184)
465        at org.junit.runners.ParentRunner.run(ParentRunner.java:236)
466        at org.apache.maven.surefire.junit4.JUnit4Provider.execute(JUnit4Provider.java:236)
467        at org.apache.maven.surefire.junit4.JUnit4Provider.executeTestSet(JUnit4Provider.java:134)
468        at org.apache.maven.surefire.junit4.JUnit4Provider.invoke(JUnit4Provider.java:113)
469        at sun.reflect.NativeMethodAccessorImpl.invoke0(Native Method)
470        at sun.reflect.NativeMethodAccessorImpl.invoke(NativeMethodAccessorImpl.java:39)
471        at sun.reflect.DelegatingMethodAccessorImpl.invoke(DelegatingMethodAccessorImpl.java:25)
472        at java.lang.reflect.Method.invoke(Method.java:597)
473        at org.apache.maven.surefire.util.ReflectionUtils.invokeMethodWithArray(ReflectionUtils.java:189)
474        at org.apache.maven.surefire.booter.ProviderFactory$ProviderProxy.invoke(ProviderFactory.java:165)
475        at org.apache.maven.surefire.booter.ProviderFactory.invokeProvider(ProviderFactory.java:85)
476        at org.apache.maven.surefire.booter.ForkedBooter.runSuitesInProcess(ForkedBooter.java:103)
477        at org.apache.maven.surefire.booter.ForkedBooter.main(ForkedBooter.java:74)
478keepOverriddenObsoleteRecords(imagej.updater.core.UpdaterTest)  Time elapsed: 0.2 sec  <<< FAILURE!
479java.lang.AssertionError:
480        at org.junit.Assert.fail(Assert.java:91)
481        at org.junit.Assert.assertTrue(Assert.java:43)
482        at org.junit.Assert.assertTrue(Assert.java:54)
483        at imagej.updater.core.UpdaterTest.keepOverriddenObsoleteRecords(UpdaterTest.java:1162)
484        at sun.reflect.NativeMethodAccessorImpl.invoke0(Native Method)
485        at sun.reflect.NativeMethodAccessorImpl.invoke(NativeMethodAccessorImpl.java:39)
486        at sun.reflect.DelegatingMethodAccessorImpl.invoke(DelegatingMethodAccessorImpl.java:25)
487        at java.lang.reflect.Method.invoke(Method.java:597)
488        at org.junit.runners.model.FrameworkMethod$1.runReflectiveCall(FrameworkMethod.java:44)
489        at org.junit.internal.runners.model.ReflectiveCallable.run(ReflectiveCallable.java:15)
490        at org.junit.runners.model.FrameworkMethod.invokeExplosively(FrameworkMethod.java:41)
491        at org.junit.internal.runners.statements.InvokeMethod.evaluate(InvokeMethod.java:20)
492        at org.junit.internal.runners.statements.RunBefores.evaluate(RunBefores.java:28)
493        at org.junit.internal.runners.statements.RunAfters.evaluate(RunAfters.java:31)
494        at org.junit.runners.BlockJUnit4ClassRunner.runChild(BlockJUnit4ClassRunner.java:76)
495        at org.junit.runners.BlockJUnit4ClassRunner.runChild(BlockJUnit4ClassRunner.java:50)
496        at org.junit.runners.ParentRunner$3.run(ParentRunner.java:193)
497        at org.junit.runners.ParentRunner$1.schedule(ParentRunner.java:52)
498        at org.junit.runners.ParentRunner.runChildren(ParentRunner.java:191)
499        at org.junit.runners.ParentRunner.access$000(ParentRunner.java:42)
500        at org.junit.runners.ParentRunner$2.evaluate(ParentRunner.java:184)
501        at org.junit.runners.ParentRunner.run(ParentRunner.java:236)
502        at org.apache.maven.surefire.junit4.JUnit4Provider.execute(JUnit4Provider.java:236)
503        at org.apache.maven.surefire.junit4.JUnit4Provider.executeTestSet(JUnit4Provider.java:134)
504        at org.apache.maven.surefire.junit4.JUnit4Provider.invoke(JUnit4Provider.java:113)
505        at sun.reflect.NativeMethodAccessorImpl.invoke0(Native Method)
506        at sun.reflect.NativeMethodAccessorImpl.invoke(NativeMethodAccessorImpl.java:39)
507        at sun.reflect.DelegatingMethodAccessorImpl.invoke(DelegatingMethodAccessorImpl.java:25)
508        at java.lang.reflect.Method.invoke(Method.java:597)
509        at org.apache.maven.surefire.util.ReflectionUtils.invokeMethodWithArray(ReflectionUtils.java:189)
510        at org.apache.maven.surefire.booter.ProviderFactory$ProviderProxy.invoke(ProviderFactory.java:165)
511        at org.apache.maven.surefire.booter.ProviderFactory.invokeProvider(ProviderFactory.java:85)
512        at org.apache.maven.surefire.booter.ForkedBooter.runSuitesInProcess(ForkedBooter.java:103)
513        at org.apache.maven.surefire.booter.ForkedBooter.main(ForkedBooter.java:74)
514testShownByDefault(imagej.updater.core.UpdaterTest)  Time elapsed: 0.22 sec  <<< ERROR!
515java.io.IOException: Could not move 'C:\Users\aivar\AppData\Local\Temp\testUpdaterIJRoot7426262898825183281\update\jars\will-have-dependency.jar' to 'C:\Users\aivar\AppData\Local\Temp\testUpdaterIJRoot7426262898825183281\.\jars\will-have-dependency.jar'
516        at imagej.updater.core.Installer.moveUpdatedIntoPlace(Installer.java:352)
517        at imagej.updater.core.Installer.moveUpdatedIntoPlace(Installer.java:340)
518        at imagej.updater.core.Installer.moveUpdatedIntoPlace(Installer.java:326)
519        at imagej.updater.core.UpdaterTest.update(UpdaterTest.java:1479)
520        at imagej.updater.core.UpdaterTest.testShownByDefault(UpdaterTest.java:1203)
521        at sun.reflect.NativeMethodAccessorImpl.invoke0(Native Method)
522        at sun.reflect.NativeMethodAccessorImpl.invoke(NativeMethodAccessorImpl.java:39)
523        at sun.reflect.DelegatingMethodAccessorImpl.invoke(DelegatingMethodAccessorImpl.java:25)
524        at java.lang.reflect.Method.invoke(Method.java:597)
525        at org.junit.runners.model.FrameworkMethod$1.runReflectiveCall(FrameworkMethod.java:44)
526        at org.junit.internal.runners.model.ReflectiveCallable.run(ReflectiveCallable.java:15)
527        at org.junit.runners.model.FrameworkMethod.invokeExplosively(FrameworkMethod.java:41)
528        at org.junit.internal.runners.statements.InvokeMethod.evaluate(InvokeMethod.java:20)
529        at org.junit.internal.runners.statements.RunBefores.evaluate(RunBefores.java:28)
530        at org.junit.internal.runners.statements.RunAfters.evaluate(RunAfters.java:31)
531        at org.junit.runners.BlockJUnit4ClassRunner.runChild(BlockJUnit4ClassRunner.java:76)
532        at org.junit.runners.BlockJUnit4ClassRunner.runChild(BlockJUnit4ClassRunner.java:50)
533        at org.junit.runners.ParentRunner$3.run(ParentRunner.java:193)
534        at org.junit.runners.ParentRunner$1.schedule(ParentRunner.java:52)
535        at org.junit.runners.ParentRunner.runChildren(ParentRunner.java:191)
536        at org.junit.runners.ParentRunner.access$000(ParentRunner.java:42)
537        at org.junit.runners.ParentRunner$2.evaluate(ParentRunner.java:184)
538        at org.junit.runners.ParentRunner.run(ParentRunner.java:236)
539        at org.apache.maven.surefire.junit4.JUnit4Provider.execute(JUnit4Provider.java:236)
540        at org.apache.maven.surefire.junit4.JUnit4Provider.executeTestSet(JUnit4Provider.java:134)
541        at org.apache.maven.surefire.junit4.JUnit4Provider.invoke(JUnit4Provider.java:113)
542        at sun.reflect.NativeMethodAccessorImpl.invoke0(Native Method)
543        at sun.reflect.NativeMethodAccessorImpl.invoke(NativeMethodAccessorImpl.java:39)
544        at sun.reflect.DelegatingMethodAccessorImpl.invoke(DelegatingMethodAccessorImpl.java:25)
545        at java.lang.reflect.Method.invoke(Method.java:597)
546        at org.apache.maven.surefire.util.ReflectionUtils.invokeMethodWithArray(ReflectionUtils.java:189)
547        at org.apache.maven.surefire.booter.ProviderFactory$ProviderProxy.invoke(ProviderFactory.java:165)
548        at org.apache.maven.surefire.booter.ProviderFactory.invokeProvider(ProviderFactory.java:85)
549        at org.apache.maven.surefire.booter.ForkedBooter.runSuitesInProcess(ForkedBooter.java:103)
550        at org.apache.maven.surefire.booter.ForkedBooter.main(ForkedBooter.java:74)
551obsoletedDependencies(imagej.updater.core.UpdaterTest)  Time elapsed: 0.06 sec  <<< FAILURE!
552java.lang.AssertionError:
553        at org.junit.Assert.fail(Assert.java:91)
554        at org.junit.Assert.assertTrue(Assert.java:43)
555        at org.junit.Assert.assertTrue(Assert.java:54)
556        at imagej.updater.core.UpdaterTest.obsoletedDependencies(UpdaterTest.java:1295)
557        at sun.reflect.NativeMethodAccessorImpl.invoke0(Native Method)
558        at sun.reflect.NativeMethodAccessorImpl.invoke(NativeMethodAccessorImpl.java:39)
559        at sun.reflect.DelegatingMethodAccessorImpl.invoke(DelegatingMethodAccessorImpl.java:25)
560        at java.lang.reflect.Method.invoke(Method.java:597)
561        at org.junit.runners.model.FrameworkMethod$1.runReflectiveCall(FrameworkMethod.java:44)
562        at org.junit.internal.runners.model.ReflectiveCallable.run(ReflectiveCallable.java:15)
563        at org.junit.runners.model.FrameworkMethod.invokeExplosively(FrameworkMethod.java:41)
564        at org.junit.internal.runners.statements.InvokeMethod.evaluate(InvokeMethod.java:20)
565        at org.junit.internal.runners.statements.RunBefores.evaluate(RunBefores.java:28)
566        at org.junit.internal.runners.statements.RunAfters.evaluate(RunAfters.java:31)
567        at org.junit.runners.BlockJUnit4ClassRunner.runChild(BlockJUnit4ClassRunner.java:76)
568        at org.junit.runners.BlockJUnit4ClassRunner.runChild(BlockJUnit4ClassRunner.java:50)
569        at org.junit.runners.ParentRunner$3.run(ParentRunner.java:193)
570        at org.junit.runners.ParentRunner$1.schedule(ParentRunner.java:52)
571        at org.junit.runners.ParentRunner.runChildren(ParentRunner.java:191)
572        at org.junit.runners.ParentRunner.access$000(ParentRunner.java:42)
573        at org.junit.runners.ParentRunner$2.evaluate(ParentRunner.java:184)
574        at org.junit.runners.ParentRunner.run(ParentRunner.java:236)
575        at org.apache.maven.surefire.junit4.JUnit4Provider.execute(JUnit4Provider.java:236)
576        at org.apache.maven.surefire.junit4.JUnit4Provider.executeTestSet(JUnit4Provider.java:134)
577        at org.apache.maven.surefire.junit4.JUnit4Provider.invoke(JUnit4Provider.java:113)
578        at sun.reflect.NativeMethodAccessorImpl.invoke0(Native Method)
579        at sun.reflect.NativeMethodAccessorImpl.invoke(NativeMethodAccessorImpl.java:39)
580        at sun.reflect.DelegatingMethodAccessorImpl.invoke(DelegatingMethodAccessorImpl.java:25)
581        at java.lang.reflect.Method.invoke(Method.java:597)
582        at org.apache.maven.surefire.util.ReflectionUtils.invokeMethodWithArray(ReflectionUtils.java:189)
583        at org.apache.maven.surefire.booter.ProviderFactory$ProviderProxy.invoke(ProviderFactory.java:165)
584        at org.apache.maven.surefire.booter.ProviderFactory.invokeProvider(ProviderFactory.java:85)
585        at org.apache.maven.surefire.booter.ForkedBooter.runSuitesInProcess(ForkedBooter.java:103)
586        at org.apache.maven.surefire.booter.ForkedBooter.main(ForkedBooter.java:74)